{"text_format":"1","workbook":"xlsx","n_sheets":16,"sheets":["Disclosures","Index","Restitution Amount","Interest Factor","Weighted Average Payment Date","Final Cost ","Final Cost Scenarios","Estimated LPCA","Actual Losses","Loss and DCCE Development","Tail Factor","Interpolated Development","Surcharges - Policy Year 1","Surcharges - Policy Year 2","Surcharges - Policy Year 3","Inputs"],"not_rendered":{"charts":0,"images":0,"macros":1,"external_links":1,"defined_names":14,"comments":0,"pivot_tables":0},"unopened":[],"bounds":{"document_bytes":16777216,"sheet_cells":100000,"rows_first":2000,"rows_last":500,"rows_between":2000,"halvings":0,"cell_chars":16384,"cell_head_chars":4096},"cells_cut":0,"cells_raw":0,"read":"whole","date_system":"1900"}

{"sheet":"Disclosures","index":0,"n_rows":23,"n_cols":1,"rows_kept":23,"cut":false,"hidden":false,"merged":[]}
["Option 3 Template Disclosures"]
[]
["Option 3 Template is designed as prescribed in Schedule 2.6 of Conservator Rehabilitation Plan and information provided by California Insurance Department Actuary. "]
[]
["DRAFT Template Delivery Date: April 15, 2026  Updated April 30, 2026 for Interest Considerations of Schedule 2.6."]
[]
["The intended purpose of this Option 3 Template is to help resolve pending and subsequent litigation against California Insurance Company and its affiliates relating to "]
["SolutionOne and EquityComp products."]
[]
["Actuarial Team:"]
["David S. Wolfe, ACAS, MAAA - Baker Tilly Advisory Group, LP"]
["Morgan Butz, FCAS, MAAA - Lewis & Ellis, LLC"]
["Joe Healey - Baker Tilly Advisory Group, LP"]
[]
["The data included in this template is based on sample files provided by legal counsel for the Conservator and by California Insurance Department Actuary."]
["The data included may not represent final documents to be provided at a later point."]
["The data underlying this template has been reviewed for reasonableness and consistency, but has not been audited or verified."]
[]
["Certain calculations within this Option 3 Template assume paid losses and case reserves are through December 31, 2025."]
[]
{"$rows_left_out":4}
{"sheet":"Index","index":1,"n_rows":27,"n_cols":1,"rows_kept":27,"cut":false,"hidden":false,"merged":[]}
["Please see below for the source for each tab within Schedule 2.6 of Conservator's Rehabilitation Plan for CIC or where guidance from the California Insurance Department Actuary was provided."]
[]
["Restitution Amount - Schedule 2.6, Section V, Subsection 2"]
[]
["Interest Factor -  Based on Schedule 2.6, Section VI Subsection 5"]
[]
["Weighted Average Payment Date  -  Based on Schedule 2.6, Section VI Subsection 5"]
[]
["Final Cost - Schedule 2.6, Section V, Subsection 2.b and communication with California Insurance Department Actuary"]
[]
["Final Cost Scenarios - Schedule 2.6, Section V, Subsection 2.b"]
[]
["Estimated LPCA - Schedule 2.6, Section V, Subsection 2.b"]
[]
["Actual Losses - Schedule 2.6, Section IV, Subsection 3, Schedule 2.6, Section IV, Subsection 3.c and communication with California Insurance Department Actuary"]
[]
["Loss and DCCE Development - Schedule 2.6, Section IV, Subsection 3.c.i-ii and communication with California Insurance Department Actuary"]
[]
["Tail Factor - Schedule 2.6, Section IV, Subsection 3.iii"]
[]
{"$rows_left_out":8}
{"sheet":"Restitution Amount","index":2,"n_rows":21,"n_cols":5,"rows_kept":21,"cut":false,"hidden":false,"merged":[[4,0,4,5],[0,0,0,5],[1,0,1,5],[2,0,2,5]]}
[{"$f":"Inputs!A1","v":"California Insurance Company Rehabilitation Plan"}]
[{"$f":"Inputs!A2","v":"Options to Settle Litigation Related to XYZ Company"}]
[{"$f":"Inputs!A3","v":"EquityComp and SolutionOne Programs and RPA"}]
[]
["Option 3 - Restitution Amount"]
[]
[-1,"Total Payments",{"$f":"ROUND(Inputs!D53,0)","v":1731228},null,"From Weighted Average"]
[null,null,null,null,"Payment Date tab, Column (7) total."]
[]
[{"$f":"A7-1","v":-2},"Final Cost",{"$f":"ROUND('Final Cost '!E25,0)","v":1434339},null,"From Final Cost tab, line (11)"]
[]
[{"$f":"A10-1","v":-3},"Restitution Amount Excluding Interest",{"$f":"ABS(C7-C10)","v":296889},null,"Absolute value of difference"]
[null,null,null,null,"between Total Payments"]
[null,null,null,null,"and Final Cost"]
[]
[{"$f":"A12-1","v":-4},"Interest Factor",{"$f":"ROUND('Interest Factor'!F14,3)","v":1.371},null,"From Interest Factor tab, Column (5)."]
[]
[{"$f":"A16-1","v":-5},"Interest",{"$f":"ROUND((C16-1)*C12,0)","v":110146},null,{"$f":"\"[(\"&-A16&\") - 1] x (\"&-A12&\")\"","v":"[(4) - 1] x (3)"}]
[]
[{"$f":"A18-1","v":-6},"Restitution Amount Including Interest",{"$f":"C12+C18","v":407035},null,{"$f":"IF(C7-C10>0, \"To be paid by CIC.\", \"To be paid by claimant.\")","v":"To be paid by CIC."}]
{"$rows_left_out":2}
{"sheet":"Interest Factor","index":3,"n_rows":23,"n_cols":9,"rows_kept":23,"cut":false,"hidden":false,"merged":[]}
[{"$f":"Inputs!A1","v":"California Insurance Company Rehabilitation Plan"}]
[{"$f":"Inputs!A2","v":"Options to Settle Litigation Related to XYZ Company"}]
[{"$f":"Inputs!A3","v":"EquityComp and SolutionOne Programs and RPA"}]
[]
["Option 3 - Interest Factor"]
[]
[null,-1,{"$f":"B7-1","v":-2},{"$f":"C7-1","v":-3},{"$f":"D7-1","v":-4},{"$f":"E7-1","v":-5}]
[]
[null,"Weighted"]
[null,"Average","Restitution"]
[null,"Payment ",{"$f":"B11","v":"Payment "},"Years","Interest","Interest"]
[null,"Date",{"$f":"B12","v":"Date"},"of Interest","Rate","Factor"]
[]
[null,{"$f":"'Weighted Average Payment Date'!M14","v":"2014-12-30T22:02:15.747"},{"$f":"Inputs!D55","v":"2026-11-01"},{"$f":"ROUND((C14-B14)/365.25,2)","v":11.84},2.7E-2,{"$f":"ROUND((1+E14)^D14,3)","v":1.371},null,null,"RESTIUTION DATE TO BE DETERMINED. SAMPLE in (2) IS FOR DRAFT TEMPLATE ONLY."]
[]
[]
[null,"Notes"]
[null,{"$f":"B7","v":-1},"From Weighted Average Payment Date tab, Column (11)."]
[null,{"$f":"C7","v":-2},"From Inputs Tab."]
[null,{"$f":"D7","v":-3},"Time (measured in years) from Weighted Average"]
{"$rows_left_out":4}
{"sheet":"Weighted Average Payment Date","index":4,"n_rows":93,"n_cols":13,"rows_kept":93,"cut":false,"hidden":false,"merged":[[83,0,83,1],[84,0,84,1],[85,0,85,1],[86,0,86,1]]}
[{"$f":"Inputs!A1","v":"California Insurance Company Rehabilitation Plan"}]
[{"$f":"Inputs!A2","v":"Options to Settle Litigation Related to XYZ Company"}]
[{"$f":"Inputs!A3","v":"EquityComp and SolutionOne Programs and RPA"}]
[]
["Option 3 - Weighted Average Time to Payment"]
[]
["XYZ Company (Account xxxxxx)  As of February 9, 2019\n "]
[]
[-1,{"$f":"A9-1","v":-2},{"$f":"B9-1","v":-3},-4,-5,-6,-7,-8,null,{"$f":"H9-1","v":-9},{"$f":"J9-1","v":-10},null,{"$f":"K9-1","v":-11}]
[null,null,null,null,null,null,null,null,null,null,null,null,"Weighted"]
[null,null,null,null,null,null,null,null,null,null,null,null,"Average"]
[null,null,null,null,null,null,null,null,null,null,null,null,"Payment "]
["Statement","For the Period",null,"Amount Billed",null,null,"Amount","Amount",null,"Midpoint of","Weighted",null,"Date"]
["Date","Beginning","Ending","Program Charges","Other Charges","Total","Paid","Due",null,"Period","Midpoint",null,{"$f":"SUM(K15:K82)/SUM(G15:G82)","v":"2014-12-30T22:02:15.747"}]
["2013-07-09","2013-06-01","2013-06-30",101673,10420.58,112093.58,112093.58,0,null,{"$f":"AVERAGE(B15:C15)","v":"2013-06-15T12:00:00"},{"$f":"J15*G15","v":4645214001.9899998}]
["2013-08-10","2013-07-01","2013-07-31",20268,1702.26,21970.26,21970.26,0,null,{"$f":"AVERAGE(B16:C16)","v":"2013-07-16"},{"$f":"J16*G16","v":911128652.45999992}]
["2013-09-11","2013-08-01","2013-08-31",36941,2924.43,39865.43,39865.43,0,null,"2013-08-16",1654495075.8599999]
["2013-10-08","2013-09-01","2013-09-30",29383,2378.58,31761.58,31761.58,0,null,"2013-09-15T12:00:00",1319137821.3500001]
["2013-11-10","2013-10-01","2013-10-31",36379,2925.05,39304.050000000003,39304.050000000003,0,null,"2013-10-16",1633594230.1500001]
["2013-12-10","2013-11-01","2013-11-30",32479,2336.81,34815.81,34815.81,0,null,"2013-11-15T12:00:00",1448111393.2349999]
{"$rows_left_out":74}
{"sheet":"Final Cost ","index":5,"n_rows":40,"n_cols":5,"rows_kept":40,"cut":false,"hidden":false,"merged":[[0,0,0,5],[1,0,1,5],[2,0,2,5]]}
[{"$f":"Inputs!A1","v":"California Insurance Company Rehabilitation Plan"}]
[{"$f":"Inputs!A2","v":"Options to Settle Litigation Related to XYZ Company"}]
[{"$f":"Inputs!A3","v":"EquityComp and SolutionOne Programs and RPA"}]
[]
["Option 3 - Final Cost"]
[]
[null,-1,"Estimated LPCA",null,{"$f":"'Estimated LPCA'!E89","v":1987207.6804999998}]
[]
[null,{"$f":"B7-1","v":-2},"Actual LPCA",null,{"$f":"Inputs!D27","v":1931656}]
[]
[null,{"$f":"B9-1","v":-3},"Actual Losses",null,{"$f":"'Actual Losses'!L29","v":131495.72736999998}]
[]
[null,{"$f":"B11-1","v":-4},"Ultimate Claim Cost",null,{"$f":"E11*E7/E9","v":135277.35755362135}]
[]
[null,{"$f":"B13-1","v":-5},"Adjusted Final Cost",null,{"$f":"IFERROR(ROUND(INDEX('Final Cost Scenarios'!D9:D37,MATCH($E$13,'Final Cost Scenarios'!C9:C37,1))+($E$13-INDEX('Final Cost Scenarios'!C9:C37,MATCH($E$13,'Final Cost Scenarios'!C9:C37,1)))*(INDEX('Final Cost Scenarios'!D9:D37,MATCH($E$13,'Final Cost Scenarios'!C9:C37,1)+1)-INDEX('Final Cost Scenarios'!D9:D37,MATCH($E$13,'Final Cost Scenarios'!C9:C37,1)))/(INDEX('Final Cost Scenarios'!C9:C37,MATCH($E$13,'Final Cost Scenarios'!C9:C37,1)+1)-INDEX('Final Cost Scenarios'!C9:C37,MATCH($E$13,'Final Cost Scenarios'!C9:C37,1))),0),'Final Cost Scenarios'!D37)","v":1389374}]
[]
[null,{"$f":"B15-1","v":-6},"Final Cost, before surcharges",null,{"$f":"E15*E9/E7","v":1350534.546378531}]
[]
[null,{"$f":"B17-1","v":-7},"Surcharges- Policy Year 1",null,{"$f":"'Surcharges - Policy Year 1'!F30","v":32828}]
[null,{"$f":"B19-1","v":-8},"Surcharges- Policy Year 2",null,{"$f":"'Surcharges - Policy Year 2'!F30","v":30993}]
{"$rows_left_out":21}
{"sheet":"Final Cost Scenarios","index":6,"n_rows":37,"n_cols":6,"rows_kept":37,"cut":false,"hidden":false,"merged":[]}
[{"$f":"Inputs!A1","v":"California Insurance Company Rehabilitation Plan"}]
[{"$f":"Inputs!A2","v":"Options to Settle Litigation Related to XYZ Company"}]
[{"$f":"Inputs!A3","v":"EquityComp and SolutionOne Programs and RPA"}]
[]
["Option 3 - Final Cost Scenarios"]
[]
[null,null,"Ultimate"]
[null,null,"Claims Cost","Final Cost",null,"Source:"]
[null,null,0,714987,null,"Workers' Compensation"]
[null,null,75000,933762,null,"Program Summary "]
[null,null,150000,1500657,null,"& Scenarios"]
[null,null,225000,1553415]
[null,null,300000,1606377]
[null,null,375000,1645896]
[null,null,450000,1685619]
[null,null,525000,1725339]
[null,null,600000,1751820]
[null,null,675000,1791339]
[null,null,750000,1817820]
[null,null,825000,1844301]
{"$rows_left_out":18}
{"sheet":"Estimated LPCA","index":7,"n_rows":96,"n_cols":5,"rows_kept":96,"cut":false,"hidden":false,"merged":[]}
[{"$f":"Inputs!A1","v":"California Insurance Company Rehabilitation Plan"}]
[{"$f":"Inputs!A2","v":"Options to Settle Litigation Related to XYZ Company"}]
[{"$f":"Inputs!A3","v":"EquityComp and SolutionOne Programs and RPA"}]
[]
["Option 3 - Estimated LPCA"]
[]
[]
[null,null,-1,{"$f":"C8-1","v":-2},{"$f":"D8-1","v":-3}]
[null,null,null,null,"Estimated"]
[null,null,"Loss Pick","Estimated","Loss Pick"]
[null,"Class","Containment","Annual","Containment"]
[null,"Code","Rate","Payroll","Amount"]
[]
[null,"Policy Year 1"]
[null,{"$f":"IF(ROWS($B$15:B15)<=Inputs!$B$59,INDEX(Inputs!$A$64:$A$139,ROWS($B$15:B15)),\"\")","v":"CA3831"},{"$f":"IF(B15=\"\",\"\",INDEX(Inputs!$E$64:$E$139,ROWS($B$15:B15)))","v":8.11},{"$f":"IF(B15=\"\",\"\",INDEX(Inputs!$B$64:$B$139,ROWS($B$15:B15)))","v":8000000},{"$f":"IF(OR(C15=\"\",D15=\"\"),\"\",C15*D15/100)","v":648799.99999999988}]
[null,{"$f":"IF(ROWS($B$15:B16)<=Inputs!$B$59,INDEX(Inputs!$A$64:$A$139,ROWS($B$15:B16)),\"\")","v":"CA8810"},{"$f":"IF(B16=\"\",\"\",INDEX(Inputs!$E$64:$E$139,ROWS($B$15:B16)))","v":1.07},{"$f":"IF(B16=\"\",\"\",INDEX(Inputs!$B$64:$B$139,ROWS($B$15:B16)))","v":2800000},{"$f":"IF(OR(C65=\"\",D16=\"\"),\"\",C16*D16/100)","v":29960}]
[null,{"$f":"IF(ROWS($B$15:B17)<=Inputs!$B$59,INDEX(Inputs!$A$64:$A$139,ROWS($B$15:B17)),\"\")","v":""},{"$f":"IF(B17=\"\",\"\",INDEX(Inputs!$E$64:$E$139,ROWS($B$15:B17)))","v":""},{"$f":"IF(B17=\"\",\"\",INDEX(Inputs!$B$64:$B$139,ROWS($B$15:B17)))","v":""},{"$f":"IF(OR(C66=\"\",D17=\"\"),\"\",C17*D17/100)","v":""}]
[null,{"$f":"IF(ROWS($B$15:B18)<=Inputs!$B$59,INDEX(Inputs!$A$64:$A$139,ROWS($B$15:B18)),\"\")","v":""},{"$f":"IF(B18=\"\",\"\",INDEX(Inputs!$E$64:$E$139,ROWS($B$15:B18)))","v":""},{"$f":"IF(B18=\"\",\"\",INDEX(Inputs!$B$64:$B$139,ROWS($B$15:B18)))","v":""},""]
[null,{"$f":"IF(ROWS($B$15:B19)<=Inputs!$B$59,INDEX(Inputs!$A$64:$A$139,ROWS($B$15:B19)),\"\")","v":""},{"$f":"IF(B19=\"\",\"\",INDEX(Inputs!$E$64:$E$139,ROWS($B$15:B19)))","v":""},{"$f":"IF(B19=\"\",\"\",INDEX(Inputs!$B$64:$B$139,ROWS($B$15:B19)))","v":""},""]
[null,{"$f":"IF(ROWS($B$15:B20)<=Inputs!$B$59,INDEX(Inputs!$A$64:$A$139,ROWS($B$15:B20)),\"\")","v":""},{"$f":"IF(B20=\"\",\"\",INDEX(Inputs!$E$64:$E$139,ROWS($B$15:B20)))","v":""},{"$f":"IF(B20=\"\",\"\",INDEX(Inputs!$B$64:$B$139,ROWS($B$15:B20)))","v":""},""]
{"$rows_left_out":77}
{"sheet":"Actual Losses","index":8,"n_rows":46,"n_cols":12,"rows_kept":46,"cut":false,"hidden":false,"merged":[]}
[{"$f":"Inputs!A1","v":"California Insurance Company Rehabilitation Plan"}]
[{"$f":"Inputs!A2","v":"Options to Settle Litigation Related to XYZ Company"}]
[{"$f":"Inputs!A3","v":"EquityComp and SolutionOne Programs and RPA"}]
[]
["Option 3 - Actual Losses"]
[null,null,null,null,null,null,"Data as of "]
[null,null,null,null,null,null,"2025-12-31"]
[]
[null,null,-1,{"$f":"C9-1","v":-2},-3,-4,-5,{"$f":"G9-1","v":-6},{"$f":"H9-1","v":-7},{"$f":"I9-1","v":-8},{"$f":"J9-1","v":-9},{"$f":"K9-1","v":-10}]
[]
[null,null,"Policy","Policy",null,null,"Age-to-",null,null,"IBNR ","IBNR"]
[null,null,"Effective ","Expiry",null,"Maturity","Ultimate","Paid","Case","Reserves","Reserves","Actual "]
[null,null,"Date","Date","Midpoint","(in months)","Factor","Losses","Reserves","Undiscounted","Discounted","Losses"]
[]
["Policy Year 1:",null,{"$f":"Inputs!D9","v":"2013-06-01"},{"$f":"Inputs!D11","v":"2014-05-31"},{"$f":"(((D15)-(C15))/2)+(C15)-1","v":"2013-11-29"},{"$f":"ROUND((_xlfn.DAYS(G$7,E15)/365*12)+6,0)","v":151},{"$f":"ROUND(VLOOKUP(F15,'Interpolated Development'!C13:E149,3,FALSE),4)","v":1.0341},{"$f":"Inputs!D31","v":66447},{"$f":"Inputs!D37","v":0},{"$f":"(G15-1)*(H15+I15)","v":2265.8427000000011},{"$f":"J15*0.9","v":2039.258430000001},{"$f":"SUM(H15,I15,K15)","v":68486.258430000002}]
[]
["Policy Year 2:",null,{"$f":"Inputs!D13","v":"2014-06-01"},{"$f":"Inputs!D15","v":"2015-05-31"},{"$f":"(((D17)-(C17))/2)+(C17)-1","v":"2014-11-29"},{"$f":"ROUND((_xlfn.DAYS(G$7,E17)/365*12)+6,0)","v":139},{"$f":"ROUND(VLOOKUP(F17,'Interpolated Development'!C15:E151,3,FALSE),4)","v":1.0363},{"$f":"Inputs!D33","v":1994},{"$f":"Inputs!C32","v":0},{"$f":"(G17-1)*(H17+I17)","v":72.382199999999997},{"$f":"J17*0.9","v":65.143979999999999},{"$f":"SUM(H17,I17,K17)","v":2059.1439799999998}]
[]
["Policy Year 3:",null,{"$f":"Inputs!D17","v":"2015-06-01"},{"$f":"Inputs!D19","v":"2016-05-30"},{"$f":"(((D19)-(C19))/2)+(C19)-1","v":"2015-11-29"},{"$f":"ROUND((_xlfn.DAYS(G$7,E19)/365*12)+6,0)","v":127},{"$f":"ROUND(VLOOKUP(F19,'Interpolated Development'!C17:E153,3,FALSE),4)","v":1.0386},{"$f":"Inputs!D35","v":58904},{"$f":"Inputs!C34","v":0},{"$f":"(G19-1)*(H19+I19)","v":2273.694399999998},{"$f":"J19*0.9","v":2046.3249599999983},{"$f":"SUM(H19,I19,K19)","v":60950.324959999998}]
[]
{"$rows_left_out":27}
{"sheet":"Loss and DCCE Development","index":9,"n_rows":43,"n_cols":11,"rows_kept":43,"cut":false,"hidden":false,"merged":[[6,1,6,10],[4,0,4,10]]}
[{"$f":"Inputs!A1","v":"California Insurance Company Rehabilitation Plan"}]
[{"$f":"Inputs!A2","v":"Options to Settle Litigation Related to XYZ Company"}]
[{"$f":"Inputs!A3","v":"EquityComp and SolutionOne Programs and RPA"}]
[]
["Option 2 - Incurred Loss and DCCE Development Pattern"]
[]
["Accident","Maturity (in months)"]
["Year",12,24,36,48,60,72,84,96,108,120]
[2009,37492,51558,54328,58689,57827,57970,55834,56584,57617,58215]
[2010,39200,54117,62865,63471,65244,62197,60670,61155,61876]
[2011,46760,67587,72296,79403,78228,77848,78213,79408]
[2012,55142,81675,99409,97682,99510,101902,101565]
[2013,76940,130887,145430,154995,163077,166385]
[2014,113867,172795,206747,222794,228952]
[2015,113068,190975,232527,244724]
[2016,107825,181017,202906]
[2017,92355,144045]
[2018,74215]
[]
[null,"Development Factors"]
{"$rows_left_out":24}
{"sheet":"Tail Factor","index":10,"n_rows":26,"n_cols":8,"rows_kept":26,"cut":false,"hidden":false,"merged":[[0,0,0,7],[1,0,1,7],[2,0,2,7],[4,0,4,7]]}
[{"$f":"Inputs!A1","v":"California Insurance Company Rehabilitation Plan"}]
[{"$f":"Inputs!A2","v":"Options to Settle Litigation Related to XYZ Company"}]
[{"$f":"Inputs!A3","v":"EquityComp and SolutionOne Programs and RPA"}]
[]
["Option 2 - Tail Factor Calculation"]
[]
[null,-1,{"$f":"B7-1","v":-2},-3,-4,-5,-6,-7]
[]
[null,null,null,null,null,null,"Indicated","Selected"]
[null,null,"Case","Ultimate","Unadjusted","Maturity","CDF at","Tail "]
[null,"IBNR","Incurred","Losses","Tail Factor","Adjustment","120 Months","Factor"]
[2009,2009,{"$f":"'Loss and DCCE Development'!K9","v":58215},{"$f":"B12+C12","v":60224},{"$f":"D12/C12","v":1.0345100060121961},1,{"$f":"E12/F12","v":1.0345100060121961},{"$f":"ROUND(AVERAGE(G12:G14),3)","v":1.04}]
[2010,3294,{"$f":"'Loss and DCCE Development'!J10","v":61876},{"$f":"B13+C13","v":65170},{"$f":"D13/C13","v":1.0532355032645937},{"$f":"'Loss and DCCE Development'!J33","v":1.0103788812329695},{"$f":"E13/F13","v":1.0424163873846275}]
[2011,5492,{"$f":"'Loss and DCCE Development'!I11","v":79408},84900,1.0691617973000203,{"$f":"('Loss and DCCE Development'!I33*'Loss and DCCE Development'!J33)","v":1.0254308568543238},{"$f":"E14/F14","v":1.042646405804335}]
[]
["Notes:"]
[{"$f":"B7","v":-1},"From CIC 2018 Annual Statement, Schedule P, Part 1 - Workers' Compensation "]
[null,"Column (15) plus Column (19)."]
[{"$f":"A17-1","v":-2},"From Loss and DCCE Development tab, last diagonal."]
[{"$f":"A19-1","v":-3}," (1) + (2)"]
{"$rows_left_out":7}
{"sheet":"Interpolated Development","index":11,"n_rows":149,"n_cols":7,"rows_kept":149,"cut":false,"hidden":false,"merged":[]}
[{"$f":"Inputs!A1","v":"California Insurance Company Rehabilitation Plan"}]
[{"$f":"Inputs!A2","v":"Options to Settle Litigation Related to XYZ Company"}]
[{"$f":"Inputs!A3","v":"EquityComp and SolutionOne Programs and RPA"}]
[]
["Option 2 - Interpolated Incurred Loss and DCCE Development Pattern"]
[]
[null,null,{"$f":"-1","v":-1},{"$f":"C7-1","v":-2},{"$f":"D7-1","v":-3}]
[]
[null,null,null,null,"Implied "]
[null,null,null,"Estimated","Cumulative"]
[null,null,"Maturity","Percent","Development"]
[null,null,"(in months)","Reported","Factor",null,"Notes:"]
[null,null,60,{"$f":"'Loss and DCCE Development'!F36","v":0.93263944399632392},{"$f":"1/D13","v":1.0722257207083572},null,"Bold entries in Column (2) from \"Loss and DCCE"]
[null,null,{"$f":"C13+1","v":61},{"$f":"$D$13*($D$25/$D$13)^((C14-$C$13)/(12))","v":0.93304326016743599},{"$f":"1/D14","v":1.0717616671069983},null,"Development\" tab corresponding Implied Percent Reported row."]
[null,null,62,{"$f":"$D$13*($D$25/$D$13)^((C15-60)/(12))","v":0.93344725118371608},1.0712978143455749]
[null,null,63,0.93385141712086861,1.0708341623371651,null,"Non-bold entries in Column (2) based on exponential interpolation."]
[null,null,64,0.93425575805463124,1.0703707109948841]
[null,null,65,0.93466027406077457,1.0699074602318841,null,"Column (3) = 1 / Column (2) for Maturity less than or equal to 120."]
[null,null,66,0.93506496521510163,1.0694444099613558,null,"For Maturity greater than 120, Column (3) is judgmentally selected as the"]
[null,null,67,0.93546983159344865,1.0689815600965269,null,"120 month estimated percent reported decayed at 0.995."]
{"$rows_left_out":130}
{"sheet":"Surcharges - Policy Year 1","index":12,"n_rows":36,"n_cols":7,"rows_kept":36,"cut":false,"hidden":false,"merged":[]}
[{"$f":"Inputs!A1","v":"California Insurance Company Rehabilitation Plan"}]
[{"$f":"Inputs!A2","v":"Options to Settle Litigation Related to XYZ Company"}]
[{"$f":"Inputs!A3","v":"EquityComp and SolutionOne Programs and RPA"}]
[]
["Option 3 - Surcharges - Policy Year 1"]
[]
[null,null,null,-1,{"$f":"D7-1","v":-2},-3]
[]
[null,null,null,"Policy","Policy","Guaranteed"]
[null,null,null,"Effective ","Expiry","Cost"]
[null,null,null,"Date","Date","Premium"]
[]
[null,null,null,{"$f":"Inputs!D9","v":"2013-06-01"},{"$f":"Inputs!D11","v":"2014-05-31"},{"$f":"Inputs!D21","v":680539}]
[]
[{"$f":"F7-1","v":-4},null,null,null,"CIGA California Domiciled Insureds:",{"$f":"ROUND(E16*F$13,0)","v":13611},"(3) x (5)"]
[{"$f":"A15-1","v":-5},null,null,null,0.02,null,"From first guaranteed cost policy."]
[-6,null,null,null,"Workers Compensation Fraud Surcharge:",{"$f":"ROUND(E18*F$13,0)","v":2593},"(3) x (7)"]
[-7,null,null,null,3.81E-3,null,"From first guaranteed cost policy."]
[-8,null,null,null,"User Funding Rate:",{"$f":"ROUND(E20*F$13,0)","v":9326},"(3) x (9)"]
[-9,null,null,null,1.3703999999999999E-2,null,"From first guaranteed cost policy."]
{"$rows_left_out":17}
{"sheet":"Surcharges - Policy Year 2","index":13,"n_rows":36,"n_cols":7,"rows_kept":36,"cut":false,"hidden":false,"merged":[]}
[{"$f":"Inputs!A1","v":"California Insurance Company Rehabilitation Plan"}]
[{"$f":"Inputs!A2","v":"Options to Settle Litigation Related to XYZ Company"}]
[{"$f":"Inputs!A3","v":"EquityComp and SolutionOne Programs and RPA"}]
[]
["Option 3 - Surcharges - Policy Year 2"]
[]
[null,null,null,-1,{"$f":"D7-1","v":-2},-3]
[]
[null,null,null,"Policy","Policy","Guaranteed"]
[null,null,null,"Effective ","Expiry","Cost"]
[null,null,null,"Date","Date","Premium"]
[]
[null,null,null,{"$f":"Inputs!D15","v":"2015-05-31"},{"$f":"Inputs!D15","v":"2015-05-31"},{"$f":"Inputs!D23","v":691795}]
[]
[{"$f":"F7-1","v":-4},null,null,null,"CIGA California Domiciled Insureds:",{"$f":"ROUND(E16*F$13,0)","v":15565},"(3) x (5)"]
[{"$f":"A15-1","v":-5},null,null,null,{"$f":"0.0225","v":2.2499999999999999E-2},null,"From second guaranteed cost policy."]
[-6,null,null,null,"Workers Compensation Fraud Surcharge:",{"$f":"ROUND(E18*F$13,0)","v":1760},"(3) x (7)"]
[-7,null,null,null,2.5439999999999998E-3,null,"From second guaranteed cost policy."]
[-8,null,null,null,"User Funding Rate:",{"$f":"ROUND(E20*F$13,0)","v":8472},"(3) x (9)"]
[-9,null,null,null,1.2246999999999999E-2,null,"From second guaranteed cost policy."]
{"$rows_left_out":17}
{"sheet":"Surcharges - Policy Year 3","index":14,"n_rows":36,"n_cols":7,"rows_kept":36,"cut":false,"hidden":false,"merged":[]}
[{"$f":"Inputs!A1","v":"California Insurance Company Rehabilitation Plan"}]
[{"$f":"Inputs!A2","v":"Options to Settle Litigation Related to XYZ Company"}]
[{"$f":"Inputs!A3","v":"EquityComp and SolutionOne Programs and RPA"}]
[]
["Option 3 - Surcharges - Policy Year 3"]
[]
[null,null,null,-1,{"$f":"D7-1","v":-2},-3]
[]
[null,null,null,"Policy","Policy","Guaranteed"]
[null,null,null,"Effective ","Expiry","Cost"]
[null,null,null,"Date","Date","Premium"]
[]
[null,null,null,{"$f":"Inputs!D17","v":"2015-06-01"},{"$f":"Inputs!D19","v":"2016-05-30"},{"$f":"Inputs!D25","v":608816}]
[]
[{"$f":"F7-1","v":-4},null,null,null,"CIGA California Domiciled Insureds:",{"$f":"ROUND(E16*F$13,0)","v":11166},"(3) x (5)"]
[{"$f":"A15-1","v":-5},null,null,null,1.8341E-2,null,"From third guaranteed cost policy."]
[-6,null,null,null,"Workers Compensation Fraud Surcharge:",{"$f":"ROUND(E18*F$13,0)","v":1104},"(3) x (7)"]
[-7,null,null,null,1.8140000000000001E-3,null,"From third guaranteed cost policy."]
[-8,null,null,null,"User Funding Rate:",{"$f":"ROUND(E20*F$13,0)","v":4323},"(3) x (9)"]
[-9,null,null,null,7.1000000000000004E-3,null,"From third guaranteed cost policy."]
{"$rows_left_out":17}
{"sheet":"Inputs","index":15,"n_rows":65,"n_cols":5,"rows_kept":65,"cut":false,"hidden":false,"merged":[[1,0,1,4],[2,0,2,4],[3,0,3,4],[4,0,4,4]]}
["California Insurance Company Rehabilitation Plan"]
[{"$f":"\"Options to Settle Litigation Related to \" & Insured","v":"Options to Settle Litigation Related to XYZ Company"}]
["EquityComp and SolutionOne Programs and RPA"]
[]
["Option 3 - Inputs"]
[]
[null,null,"Insured:","XYZ Company"]
[]
[null,null,"First Policy Effective Date:","2013-06-01"]
[]
[null,null,"First Policy Expiry Date:",{"$f":"D9+(364)","v":"2014-05-31"}]
[]
[null,null,"Second Policy Effective Date:","2014-06-01"]
[]
[null,null,"Second Policy Expiry Date:",{"$f":"D13+(364)","v":"2015-05-31"}]
[]
[null,null,"Third Policy Effective Date:","2015-06-01"]
[]
[null,null,"Third Policy Expiry Date:",{"$f":"D17+(364)","v":"2016-05-30"}]
[]
{"$rows_left_out":45}